{"text_format":"3","workbook":"xlsx","n_sheets":49,"sheets":["赤水联社","正安联社","仁怀茅台农商行","凤冈联社","务川联社","习水联社","安顺农商行","普定联社","镇宁联社","关岭农商行","紫云农商行","平塘农商行","罗甸联社","三都农商行","长顺联社","从江农商行","榕江联社","黎平农商行","台江联社","三穗农商行","岑巩联社","镇远联社","施秉联社","黄平农商行","雷山联社","凯里农商行","德江联社","江口联社","沿河联社","石阡联社","印江联社","思南农商行","松桃联社","黔西农商行","纳雍联社","威宁联社","赫章农商行","金沙联社","织金农商行","水城联社","盘县联社","六枝联社","六盘水农商行","望谟联社","册亨联社","晴隆农商行","贞丰农商行","安龙农商行","兴义农商行"],"not_rendered":{"external_links":1},"read":"whole","date_system":"1900"}

{"sheet":"赤水联社","index":0,"n_rows":5,"n_cols":9,"rows_kept":5,"merged":[[0,0,0,8]]}
["贵州省农村信用社2018年定向招聘贫困大学生进入面试人员综合成绩表（百分制）"]
["序号","市（州）","招聘单位","姓名","准考证号","综合成绩（百分制）","百分制综合成绩排名","是否入围体检","备注"]
[1,"遵义","赤水市农村信用合作联社","胡国美","1812010075227",{"v":68.5,"d":"68.50"},1,"是"]
[2,"遵义","赤水市农村信用合作联社","李宗秀","1812010154536",{"v":62.1,"d":"62.10"},2,"否"]
[3,"遵义","赤水市农村信用合作联社","姜小方","1812010006915",{"v":62.7,"d":"62.70"},3,"否"]

{"sheet":"正安联社","index":1,"n_rows":14,"n_cols":9,"rows_kept":14,"merged":[[0,0,0,8]]}
["贵州省农村信用社2018年定向招聘贫困大学生进入面试人员综合成绩表（百分制）"]
["序号","市（州）","招聘单位","姓名","准考证号","综合成绩（百分制）","百分制综合成绩排名","是否入围体检","备注"]
[1,"遵义","正安县农村信用合作联社","吴建刚","1812010165815",{"v":73.7,"d":"73.70"},1,"是"]
[2,"遵义","正安县农村信用合作联社","李杰","1812010163623",{"v":72.9,"d":"72.90"},2,"是"]
[3,"遵义","正安县农村信用合作联社","朱亚娟","1812010135020",{"v":72.7,"d":"72.70"},3,"是"]
[4,"遵义","正安县农村信用合作联社","田仁艳","1812010228807",{"v":71.3,"d":"71.30"},4,"是"]
{"$rows_left_out":9}
{"sheet":"仁怀茅台农商行","index":2,"n_rows":33,"n_cols":9,"rows_kept":33,"merged":[[0,0,0,8]]}
["贵州省农村信用社2018年定向招聘贫困大学生进入面试人员综合成绩表（百分制）"]
["序号","市（州）","招聘单位","姓名","准考证号","综合成绩（百分制）","百分制综合成绩排名","是否入围体检","备注"]
[1,"遵义","贵州仁怀茅台农村商业银行","罗廷","1812010156804",{"v":78.6,"d":"78.60"},1,"是"]
[2,"遵义","贵州仁怀茅台农村商业银行","邓波","1812010036812",{"v":75.19999999999999,"d":"75.20"},2,"是"]
[3,"遵义","贵州仁怀茅台农村商业银行","聂若来","1812010074022",{"v":74.6,"d":"74.60"},3,"是"]
[4,"遵义","贵州仁怀茅台农村商业银行","聂顺勇","1812010127220",{"v":74.39999999999999,"d":"74.40"},4,"是"]
{"$rows_left_out":28}
{"sheet":"凤冈联社","index":3,"n_rows":26,"n_cols":9,"rows_kept":26,"merged":[[0,0,0,8]]}
["贵州省农村信用社2018年定向招聘贫困大学生进入面试人员综合成绩表（百分制）"]
["序号","市（州）","招聘单位","姓名","准考证号","综合成绩（百分制）","百分制综合成绩排名","是否入围体检","备注"]
[1,"遵义","凤冈县农村信用合作联社","王晶晶","1812010313216",{"v":70.1,"d":"70.10"},1,"是"]
[2,"遵义","凤冈县农村信用合作联社","吴晓翠","1812010176304",{"v":69.5,"d":"69.50"},2,"是"]
[3,"遵义","凤冈县农村信用合作联社","付忠丽","1812010225027",{"v":69.1,"d":"69.10"},3,"是"]
[4,"遵义","凤冈县农村信用合作联社","祝娜娜","1812010327420",{"v":68.4,"d":"68.40"},4,"是"]
{"$rows_left_out":21}
{"sheet":"务川联社","index":4,"n_rows":32,"n_cols":9,"rows_kept":32,"merged":[[0,0,0,8]]}
["贵州省农村信用社2018年定向招聘贫困大学生进入面试人员综合成绩表（百分制）"]
["序号","市（州）","招聘单位","姓名","准考证号","综合成绩（百分制）","百分制综合成绩排名","是否入围体检","备注"]
[1,"遵义","务川县农村信用合作联社","高明娟","1812010034638",75.05,1,"是"]
[2,"遵义","务川县农村信用合作联社","申圣","1812010243922",{"v":72,"d":"72.00"},2,"是"]
[3,"遵义","务川县农村信用合作联社","陈素娟","1812010239524",{"v":71.4,"d":"71.40"},3,"是"]
[4,"遵义","务川县农村信用合作联社","徐琴","1812010310042",{"v":71.2,"d":"71.20"},4,"是"]
{"$rows_left_out":27}
{"sheet":"习水联社","index":5,"n_rows":18,"n_cols":9,"rows_kept":18,"merged":[[0,0,0,8]]}
["贵州省农村信用社2018年定向招聘贫困大学生进入面试人员综合成绩表（百分制）"]
["序号","市（州）","招聘单位","姓名","准考证号","综合成绩（百分制）","百分制综合成绩排名","是否入围体检","备注"]
[1,"遵义","习水县农村信用合作联社","吴涛","1812010165913",{"v":72.4,"d":"72.40"},1,"是"]
[2,"遵义","习水县农村信用合作联社","刘玉芳","1812010072806",{"v":71.4,"d":"71.40"},2,"是"]
[3,"遵义","习水县农村信用合作联社","王川","1812010147928",{"v":70.1,"d":"70.10"},3,"是"]
[4,"遵义","习水县农村信用合作联社","赵春艳","1812010247705",{"v":69.6,"d":"69.60"},4,"是"]
{"$rows_left_out":13}
{"sheet":"安顺农商行","index":6,"n_rows":23,"n_cols":9,"rows_kept":23,"merged":[[0,0,0,8]]}
["贵州省农村信用社2018年定向招聘贫困大学生进入面试人员综合成绩表（百分制）"]
["序号","市（州）","招聘单位","姓名","准考证号","综合成绩（百分制）","百分制综合成绩排名","是否入围体检","备注"]
[1,"安顺","贵州安顺农村商业银行","陈国国","1812010238931",{"v":75,"d":"75.00"},1,"是"]
[2,"安顺","贵州安顺农村商业银行","陆梦霞","1812010185915",{"v":73.4,"d":"73.40"},2,"是"]
[3,"安顺","贵州安顺农村商业银行","宋培红","1812010152547",{"v":67.9,"d":"67.90"},3,"是"]
[5,"安顺","贵州安顺农村商业银行","陈海英","1812010094748",{"v":66.6,"d":"66.60"},4,"是"]
{"$rows_left_out":18}
{"sheet":"普定联社","index":7,"n_rows":63,"n_cols":9,"rows_kept":63,"merged":[[0,0,0,8]]}
["贵州省农村信用社2018年定向招聘贫困大学生进入面试人员综合成绩表（百分制）"]
["序号","市（州）","招聘单位","姓名","准考证号","综合成绩（百分制）","百分制综合成绩排名","是否入围体检","备注"]
[1,"安顺","普定县农村信用合作联社","姜兴同","1812010134740",{"v":75.9,"d":"75.90"},1,"是"]
[2,"安顺","普定县农村信用合作联社","张霞","1812010117542",{"v":74.6,"d":"74.60"},2,"是"]
[3,"安顺","普定县农村信用合作联社","陶宇","1812010241051",{"v":73.7,"d":"73.70"},3,"是"]
[4,"安顺","普定县农村信用合作联社","李兵","1812010203610",{"v":72.8,"d":"72.80"},4,"是"]
{"$rows_left_out":58}
{"sheet":"镇宁联社","index":8,"n_rows":11,"n_cols":9,"rows_kept":11,"merged":[[0,0,0,8]]}
["贵州省农村信用社2018年定向招聘贫困大学生进入面试人员综合成绩表（百分制）"]
["序号","市（州）","招聘单位","姓名","准考证号","综合成绩（百分制）","百分制综合成绩排名","是否入围体检","备注"]
[1,"安顺","镇宁县农村信用合作联社","李兴才","1812010063203",{"v":62.599999999999994,"d":"62.60"},1,"是"]
[2,"安顺","镇宁县农村信用合作联社","王建羽","1812010307422",{"v":58.4,"d":"58.40"},2,"是"]
[3,"安顺","镇宁县农村信用合作联社","王簪","1812010269052",{"v":57.9,"d":"57.90"},3,"是"]
[4,"安顺","镇宁县农村信用合作联社","王德智","1812010101732",{"v":55.8,"d":"55.80"},4,"否"]
{"$rows_left_out":6}
{"sheet":"关岭农商行","index":9,"n_rows":37,"n_cols":9,"rows_kept":37,"merged":[[0,0,0,8]]}
["贵州省农村信用社2018年定向招聘贫困大学生进入面试人员综合成绩表（百分制）"]
["序号","市（州）","招聘单位","姓名","准考证号","综合成绩（百分制）","百分制综合成绩排名","是否入围体检","备注"]
[1,"安顺","贵州关岭农村商业银行","彭信江","1812010098111",{"v":74.3,"d":"74.30"},1,"是"]
[2,"安顺","贵州关岭农村商业银行","朱思佳","1812010186719",{"v":69.60000000000001,"d":"69.60"},2,"是"]
[3,"安顺","贵州关岭农村商业银行","宋保进","1812010133017",{"v":69.3,"d":"69.30"},3,"是"]
[4,"安顺","贵州关岭农村商业银行","黄梅","1812010180637",{"v":69,"d":"69.00"},4,"是"]
{"$rows_left_out":32}
{"sheet":"紫云农商行","index":10,"n_rows":11,"n_cols":9,"rows_kept":11,"merged":[[0,0,0,8]]}
["贵州省农村信用社2018年定向招聘贫困大学生进入面试人员综合成绩表（百分制）"]
["序号","市（州）","招聘单位","姓名","准考证号","综合成绩（百分制）","百分制综合成绩排名","是否入围体检","备注"]
[1,"安顺","贵州紫云农村商业银行","梁婷","1812010114650",{"v":73.6,"d":"73.60"},1,"是"]
[2,"安顺","贵州紫云农村商业银行","田彪","1812010088052",{"v":72.1,"d":"72.10"},2,"是"]
[3,"安顺","贵州紫云农村商业银行","朱荣欢","1812010228249",{"v":71.89999999999999,"d":"71.90"},3,"是"]
[4,"安顺","贵州紫云农村商业银行","秦定海","1812010095606",{"v":70.60000000000001,"d":"70.60"},4,"否"]
{"$rows_left_out":6}
{"sheet":"平塘农商行","index":11,"n_rows":9,"n_cols":9,"rows_kept":9,"merged":[[0,0,0,8]]}
["贵州省农村信用社2018年定向招聘贫困大学生进入面试人员综合成绩表（百分制）"]
["序号","市（州）","招聘单位","姓名","准考证号","综合成绩（百分制）","百分制综合成绩排名","是否入围体检","备注"]
[1,"黔南州","贵州平塘农村商业银行","张成美","1812010215211",{"v":74.5,"d":"74.50"},1,"是"]
[2,"黔南州","贵州平塘农村商业银行","罗焕","1812010065237",{"v":72,"d":"72.00"},2,"是"]
[3,"黔南州","贵州平塘农村商业银行","石国辉","1812010099634",{"v":70.4,"d":"70.40"},3,"否"]
[4,"黔南州","贵州平塘农村商业银行","林静兰","1812010010829",{"v":69.3,"d":"69.30"},4,"否"]
{"$rows_left_out":4}
{"sheet":"罗甸联社","index":12,"n_rows":11,"n_cols":9,"rows_kept":11,"merged":[[0,0,0,8]]}
["贵州省农村信用社2018年定向招聘贫困大学生进入面试人员综合成绩表（百分制）"]
["序号","市（州）","招聘单位","姓名","准考证号","综合成绩（百分制）","百分制综合成绩排名","是否入围体检","备注"]
[1,"黔南州","罗甸县农村信用合作联社","易忠惠","1812010198132",{"v":71.7,"d":"71.70"},1,"是"]
[2,"黔南州","罗甸县农村信用合作联社","陈明才","1812010222742",{"v":69.5,"d":"69.50"},2,"是"]
[3,"黔南州","罗甸县农村信用合作联社","黄元规","1812010208931",{"v":68.3,"d":"68.30"},3,"是"]
[4,"黔南州","罗甸县农村信用合作联社","黄建宇","1812010101502",{"v":67.7,"d":"67.70"},4,"否"]
{"$rows_left_out":6}
{"sheet":"三都农商行","index":13,"n_rows":50,"n_cols":9,"rows_kept":50,"merged":[[0,0,0,8]]}
["贵州省农村信用社2018年定向招聘贫困大学生进入面试人员综合成绩表（百分制）"]
["序号","市（州）","招聘单位","姓名","准考证号","综合成绩（百分制）","百分制综合成绩排名","是否入围体检","备注"]
[1,"黔南州","贵州三都农村商业银行","蒙元璋","1812010176704",{"v":73.5,"d":"73.50"},1,"是"]
[2,"黔南州","贵州三都农村商业银行","韦秋梅","1812010249240",{"v":70,"d":"70.00"},2,"是"]
[3,"黔南州","贵州三都农村商业银行","舒其权","1812010265045",{"v":69.60000000000001,"d":"69.60"},3,"是"]
[4,"黔南州","贵州三都农村商业银行","廖金汉","1812010151844",{"v":68.9,"d":"68.90"},4,"是"]
{"$rows_left_out":45}
{"sheet":"长顺联社","index":14,"n_rows":28,"n_cols":9,"rows_kept":28,"merged":[[0,0,0,8]]}
["贵州省农村信用社2018年定向招聘贫困大学生进入面试人员综合成绩表（百分制）"]
["序号","市（州）","招聘单位","姓名","准考证号","综合成绩（百分制）","百分制综合成绩排名","是否入围体检","备注"]
["1","黔南州","长顺县农村信用合作联社","何婷婷",{"$f":"VLOOKUP(D3,[1]黔南!$B$5:$M$93,12,0)","v":"1812010060032"},{"v":74.7,"d":"74.70"},1,"是"]
["2","黔南州","长顺县农村信用合作联社","罗雪梅",{"$f":"VLOOKUP(D4,[1]黔南!$B$5:$M$93,12,0)","v":"1812010318422"},{"v":74.3,"d":"74.30"},2,"是"]
["3","黔南州","长顺县农村信用合作联社","余风光",{"$f":"VLOOKUP(D5,[1]黔南!$B$5:$M$93,12,0)","v":"1812010060539"},{"v":73.8,"d":"73.80"},3,"是"]
["4","黔南州","长顺县农村信用合作联社","杨倩",{"$f":"VLOOKUP(D6,[1]黔南!$B$5:$M$93,12,0)","v":"1812010010554"},{"v":73.1,"d":"73.10"},4,"是"]
{"$rows_left_out":23}
{"sheet":"从江农商行","index":15,"n_rows":13,"n_cols":9,"rows_kept":13,"merged":[[0,0,0,8]]}
["贵州省农村信用社2018年定向招聘贫困大学生进入面试人员综合成绩表（百分制）"]
["序号","市（州）","招聘单位","姓名","准考证号","综合成绩（百分制）","百分制综合成绩排名","是否入围体检","备注"]
[1,"黔东南","贵州从江农村商业银行","陆新辉","1812010246240",{"v":71.6,"d":"71.60"},1,"是"]
[2,"黔东南","贵州从江农村商业银行","罗启仙","1812010011237",{"v":71.7,"d":"71.70"},2,"是"]
[3,"黔东南","贵州从江农村商业银行","吴瑛","1812010084460",{"v":69.9,"d":"69.90"},3,"是"]
[4,"黔东南","贵州从江农村商业银行","潘学良","1812010033948",{"v":69,"d":"69.00"},4,"否"]
{"$rows_left_out":8}
{"sheet":"榕江联社","index":16,"n_rows":29,"n_cols":9,"rows_kept":29,"merged":[[0,0,0,8]]}
["贵州省农村信用社2018年定向招聘贫困大学生进入面试人员综合成绩表（百分制）"]
["序号","市（州）","招聘单位","姓名","准考证号","综合成绩（百分制）","百分制综合成绩排名","是否入围体检","备注"]
[1,"黔东南","榕江县农村信用合作联社","李杰华","1812010049133",74.63,1,"是"]
[2,"黔东南","榕江县农村信用合作联社","杨秀贤","1812010148212",{"v":74.39999999999999,"d":"74.40"},2,"是"]
[3,"黔东南","榕江县农村信用合作联社","杨昌颖","1812010063456",{"v":73.35000000000001,"d":"73.35"},3,"是"]
[4,"黔东南","榕江县农村信用合作联社","龙云芝","1812010042018",{"v":73.3,"d":"73.30"},4,"是"]
{"$rows_left_out":24}
{"sheet":"黎平农商行","index":17,"n_rows":31,"n_cols":9,"rows_kept":31,"merged":[[0,0,0,8]]}
["贵州省农村信用社2018年定向招聘贫困大学生进入面试人员综合成绩表（百分制）"]
["序号","市（州）","招聘单位","姓名","准考证号","综合成绩（百分制）","百分制综合成绩排名","是否入围体检","备注"]
[1,"黔东南","贵州黎平农村商业银行","李俊成","1812010077527",71.25,1,"是"]
[2,"黔东南","贵州黎平农村商业银行","龙福芝","1812010314386",{"v":70.7,"d":"70.70"},2,"是"]
[3,"黔东南","贵州黎平农村商业银行","杨秀敏","1812010023736",{"v":70,"d":"70.00"},3,"是"]
[4,"黔东南","贵州黎平农村商业银行","罗传芬","1812010201916",{"v":69.9,"d":"69.90"},4,"是"]
{"$rows_left_out":26}
{"sheet":"台江联社","index":18,"n_rows":34,"n_cols":9,"rows_kept":34,"merged":[[0,0,0,8]]}
["贵州省农村信用社2018年定向招聘贫困大学生进入面试人员综合成绩表（百分制）"]
["序号","市（州）","招聘单位","姓名","准考证号","综合成绩（百分制）","百分制综合成绩排名","是否入围体检","备注"]
[1,"黔东南","台江县农村信用合作联社","黄宗良","1812010019804",{"v":75.8,"d":"75.80"},1,"是"]
[2,"黔东南","台江县农村信用合作联社","唐胜敏","1812010091502",{"v":72.7,"d":"72.70"},2,"是"]
[3,"黔东南","台江县农村信用合作联社","罗安鹏","1812010064050",{"v":72.5,"d":"72.50"},3,"是"]
[4,"黔东南","台江县农村信用合作联社","杨光明","1812010184821",{"v":71.7,"d":"71.70"},4,"是"]
{"$rows_left_out":29}
{"sheet":"三穗农商行","index":19,"n_rows":11,"n_cols":9,"rows_kept":11,"merged":[[0,0,0,8]]}
["贵州省农村信用社2018年定向招聘贫困大学生进入面试人员综合成绩表（百分制）"]
["序号","市（州）","招聘单位","姓名","准考证号","综合成绩（百分制）","百分制综合成绩排名","是否入围体检","备注"]
[1,"黔东南","贵州三穗农村商业银行","吴梅","1812010048730",{"v":75.1,"d":"75.10"},1,"是"]
[2,"黔东南","贵州三穗农村商业银行","吴灵湖","1812010151210",{"v":74,"d":"74.00"},2,"是"]
[3,"黔东南","贵州三穗农村商业银行","毛金涛","1812010061759",{"v":73.5,"d":"73.50"},3,"是"]
[4,"黔东南","贵州三穗农村商业银行","秦艳","1812010020247",{"v":70.7,"d":"70.70"},4,"否"]
{"$rows_left_out":6}
{"sheet":"岑巩联社","index":20,"n_rows":9,"n_cols":9,"rows_kept":9,"merged":[[0,0,0,8]]}
["贵州省农村信用社2018年定向招聘贫困大学生进入面试人员综合成绩表（百分制）"]
["序号","市（州）","招聘单位","姓名","准考证号","综合成绩（百分制）","百分制综合成绩排名","是否入围体检","备注"]
[1,"黔东南","岑巩县农村信用合作联社","杨梅平","1812010061233",{"v":73.4,"d":"73.40"},1,"是"]
[2,"黔东南","岑巩县农村信用合作联社","杨政乾","1812010171125",{"v":71.6,"d":"71.60"},2,"是"]
[3,"黔东南","岑巩县农村信用合作联社","杨春","1812010052837",{"v":71.5,"d":"71.50"},3,"否"]
[4,"黔东南","岑巩县农村信用合作联社","宋平","1812010172440",{"v":68.80000000000001,"d":"68.80"},4,"否"]
{"$rows_left_out":4}
{"sheet":"镇远联社","index":21,"n_rows":17,"n_cols":9,"rows_kept":17,"merged":[[0,0,0,8]]}
["贵州省农村信用社2018年定向招聘贫困大学生进入面试人员综合成绩表（百分制）"]
["序号","市（州）","招聘单位","姓名","准考证号","综合成绩（百分制）","百分制综合成绩排名","是否入围体检","备注"]
[1,"黔东南","镇远县农村信用合作联社","唐  城","1812010070653",{"v":74.2,"d":"74.20"},1,"是"]
[2,"黔东南","镇远县农村信用合作联社","王宗举","1812010102141",{"v":72.9,"d":"72.90"},2,"是"]
[3,"黔东南","镇远县农村信用合作联社","龙安水","1812010177622",{"v":72.2,"d":"72.20"},3,"是"]
[4,"黔东南","镇远县农村信用合作联社","蒋小勇","1812010161443",{"v":71.8,"d":"71.80"},4,"是"]
{"$rows_left_out":12}
{"sheet":"施秉联社","index":22,"n_rows":8,"n_cols":9,"rows_kept":8,"merged":[[0,0,0,8]]}
["贵州省农村信用社2018年定向招聘贫困大学生进入面试人员综合成绩表（百分制）"]
["序号","市（州）","招聘单位","姓名","准考证号","综合成绩（百分制）","百分制综合成绩排名","是否入围体检","备注"]
[1,"黔东南","施秉县农村信用合作联社","袁江坪","1812010326033",{"v":74.60000000000001,"d":"74.60"},1,"是"]
[2,"黔东南","施秉县农村信用合作联社","廖  红","1812010307515",{"v":73.3,"d":"73.30"},2,"是"]
[3,"黔东南","施秉县农村信用合作联社","龙合凤","1812010062526",{"v":72.10000000000001,"d":"72.10"},3,"否"]
[4,"黔东南","施秉县农村信用合作联社","吴朝银","1812010219068",{"v":68.32000000000001,"d":"68.32"},4,"否"]
{"$rows_left_out":3}
{"sheet":"黄平农商行","index":23,"n_rows":9,"n_cols":9,"rows_kept":9,"merged":[[0,0,0,8]]}
["贵州省农村信用社2018年定向招聘贫困大学生进入面试人员综合成绩表（百分制）"]
["序号","市（州）","招聘单位","姓名","准考证号","综合成绩（百分制）","百分制综合成绩排名","是否入围体检","备注"]
[1,"黔东南","贵州黄平农村商业银行","胡梅","1812010200746",{"v":71.6,"d":"71.60"},1,"是"]
[2,"黔东南","贵州黄平农村商业银行","张飞","1812010172291",{"v":71.10000000000001,"d":"71.10"},2,"是"]
[3,"黔东南","贵州黄平农村商业银行","田景慧","1812010099236",{"v":66.20000000000002,"d":"66.20"},3,"否"]
[4,"黔东南","贵州黄平农村商业银行","吴秋池","1812010274427",{"v":66.20000000000002,"d":"66.20"},3,"否"]
{"$rows_left_out":4}
{"sheet":"雷山联社","index":24,"n_rows":32,"n_cols":9,"rows_kept":32,"merged":[[0,0,0,8]]}
["贵州省农村信用社2018年定向招聘贫困大学生进入面试人员综合成绩表（百分制）"]
["序号","市（州）","招聘单位","姓名","准考证号","综合成绩（百分制）","百分制综合成绩排名","是否入围体检","备注"]
[1,"黔东南","雷山县农村信用合作联社","文青海","1812010132341",{"v":76.5,"d":"76.50"},1,"是"]
[2,"黔东南","雷山县农村信用合作联社","明毅","1812010063538",{"v":74.2,"d":"74.20"},2,"是"]
[3,"黔东南","雷山县农村信用合作联社","陆定倩","1812010066779",{"v":70.60000000000001,"d":"70.60"},3,"是"]
[4,"黔东南","雷山县农村信用合作联社","任婷婷","1812010103029",{"v":69.39999999999999,"d":"69.40"},4,"是"]
{"$rows_left_out":27}
{"sheet":"凯里农商行","index":25,"n_rows":14,"n_cols":9,"rows_kept":14,"merged":[[0,0,0,8]]}
["贵州省农村信用社2018年定向招聘贫困大学生进入面试人员综合成绩表（百分制）"]
["序号","市（州）","招聘单位","姓名","准考证号","综合成绩（百分制）","百分制综合成绩排名","是否入围体检","备注"]
[1,"黔东南","贵州凯里农村商业银行","范维维","1812010145344",{"v":75.4,"d":"75.40"},1,"是"]
[2,"黔东南","贵州凯里农村商业银行","杨世文","1812010205222",73.65,2,"是"]
[3,"黔东南","贵州凯里农村商业银行","罗桂菊","1812010253432",{"v":72.5,"d":"72.50"},3,"是"]
[4,"黔东南","贵州凯里农村商业银行","石桥","1812010295618",{"v":71.39999999999999,"d":"71.40"},4,"是"]
{"$rows_left_out":9}
{"sheet":"德江联社","index":26,"n_rows":19,"n_cols":9,"rows_kept":19,"merged":[[0,0,0,8]]}
["贵州省农村信用社2018年定向招聘贫困大学生进入面试人员综合成绩表（百分制）"]
["序号","市（州）","招聘单位","姓名","准考证号","综合成绩（百分制）","百分制综合成绩排名","是否入围体检","备注"]
[1,"铜仁","德江县农村信用合作联社","王周","1812010295534",{"v":73.9,"d":"73.90"},1,"是"]
[2,"铜仁","德江县农村信用合作联社","周丽娅","1812010051843",{"v":73.5,"d":"73.50"},2,"是"]
[3,"铜仁","德江县农村信用合作联社","梁顺","1812010214201",{"v":72.89999999999999,"d":"72.90"},3,"是"]
[4,"铜仁","德江县农村信用合作联社","甘鑫","1812010185424",{"v":72.5,"d":"72.50"},4,"是"]
{"$rows_left_out":14}
{"sheet":"江口联社","index":27,"n_rows":5,"n_cols":9,"rows_kept":5,"merged":[[0,0,0,8]]}
["贵州省农村信用社2018年定向招聘贫困大学生进入面试人员综合成绩表（百分制）"]
["序号","市（州）","招聘单位","姓名","准考证号","综合成绩（百分制）","百分制综合成绩排名","是否入围体检","备注"]
[1,"铜仁","江口县农村信用合作联社","杨城","1812010301809",{"v":68.21000000000001,"d":"68.21"},1,"是"]
[2,"铜仁","江口县农村信用合作联社","黄遥","1812010085517",63.45,2,"否"]
[3,"铜仁","江口县农村信用合作联社","吴艳","1812010108219",{"v":56.8,"d":"56.80"},3,"否"]

{"sheet":"沿河联社","index":28,"n_rows":35,"n_cols":9,"rows_kept":35,"merged":[[0,0,0,8]]}
["贵州省农村信用社2018年定向招聘贫困大学生进入面试人员综合成绩表（百分制）"]
["序号","市（州）","招聘单位","姓名","准考证号","综合成绩（百分制）","百分制综合成绩排名","是否入围体检","备注"]
[1,"铜仁","沿河县农村信用合作联社","张周","1812010205741",{"v":77.5,"d":"77.50"},1,"是"]
[2,"铜仁","沿河县农村信用合作联社","任聪","1812010269614",{"v":76.5,"d":"76.50"},2,"是"]
[3,"铜仁","沿河县农村信用合作联社","肖韵","1812010174824",{"v":74.1,"d":"74.10"},3,"是"]
[4,"铜仁","沿河县农村信用合作联社","刘鹏","1812010321105",{"v":73.4,"d":"73.40"},4,"是"]
{"$rows_left_out":30}
{"sheet":"石阡联社","index":29,"n_rows":34,"n_cols":9,"rows_kept":34,"merged":[[0,0,0,8]]}
["贵州省农村信用社2018年定向招聘贫困大学生进入面试人员综合成绩表（百分制）"]
["序号","市（州）","招聘单位","姓名","准考证号","综合成绩（百分制）","百分制综合成绩排名","是否入围体检","备注"]
[1,"铜仁","石阡县农村信用合作联社","游志强","1812010057612",{"v":73,"d":"73.00"},1,"是"]
[2,"铜仁","石阡县农村信用合作联社","谭武","1812010322343",{"v":72.69999999999999,"d":"72.70"},2,"是"]
[3,"铜仁","石阡县农村信用合作联社","苏星有","1812010099315",{"v":72.4,"d":"72.40"},3,"是"]
[4,"铜仁","石阡县农村信用合作联社","郭长涛","1812010125137",{"v":71.20000000000002,"d":"71.20"},4,"是"]
{"$rows_left_out":29}
{"sheet":"印江联社","index":30,"n_rows":11,"n_cols":9,"rows_kept":11,"merged":[[0,0,0,8]]}
["贵州省农村信用社2018年定向招聘贫困大学生进入面试人员综合成绩表（百分制）"]
["序号","市（州）","招聘单位","姓名","准考证号","综合成绩（百分制）","百分制综合成绩排名","是否入围体检","备注"]
[1,"铜仁","印江县农村信用合作联社","王海慧","1812010157005",{"v":76.2,"d":"76.20"},1,"是"]
[2,"铜仁","印江县农村信用合作联社","刘安精","1812010017111",{"v":73.3,"d":"73.30"},2,"是"]
[3,"铜仁","印江县农村信用合作联社","彭柳江","1812010177312",{"v":69.9,"d":"69.90"},3,"是"]
[4,"铜仁","印江县农村信用合作联社","吴正英","1812010021005",{"v":68.60000000000001,"d":"68.60"},4,"否"]
{"$rows_left_out":6}
{"sheet":"思南农商行","index":31,"n_rows":8,"n_cols":9,"rows_kept":8,"merged":[[0,0,0,8]]}
["贵州省农村信用社2018年定向招聘贫困大学生进入面试人员综合成绩表（百分制）"]
["序号","市（州）","招聘单位","姓名","准考证号","综合成绩（百分制）","百分制综合成绩排名","是否入围体检","备注"]
[1,"铜仁","贵州思南农村商业银行","刘顺婵","1812010131829",{"v":75.1,"d":"75.10"},1,"是"]
[2,"铜仁","贵州思南农村商业银行","王登泽","1812010191843",{"v":69.5,"d":"69.50"},2,"是"]
[3,"铜仁","贵州思南农村商业银行","李旭艳","1812010022708",{"v":68.3,"d":"68.30"},3,"否"]
[4,"铜仁","贵州思南农村商业银行","何琴","1812010264316",{"v":66.9,"d":"66.90"},4,"否"]
{"$rows_left_out":3}
{"sheet":"松桃联社","index":32,"n_rows":9,"n_cols":9,"rows_kept":9,"merged":[[0,0,0,8]]}
["贵州省农村信用社2018年定向招聘贫困大学生进入面试人员综合成绩表（百分制）"]
["序号","市（州）","招聘单位","姓名","准考证号","综合成绩（百分制）","百分制综合成绩排名","是否入围体检","备注"]
[1,"铜仁","松桃县农村信用合作联社","梁明海","1812010040804",{"v":71.10000000000001,"d":"71.10"},1,"是"]
[2,"铜仁","松桃县农村信用合作联社","曾智炜","1812010176623",69.78,2,"是"]
[3,"铜仁","松桃县农村信用合作联社","何猛","1812010234201",66.95,3,"否"]
[4,"铜仁","松桃县农村信用合作联社","余建","1812010323525",{"v":66.44999999999999,"d":"66.45"},4,"否"]
{"$rows_left_out":4}
{"sheet":"黔西农商行","index":33,"n_rows":18,"n_cols":9,"rows_kept":18,"merged":[[0,0,0,8]]}
["贵州省农村信用社2018年定向招聘贫困大学生进入面试人员综合成绩表（百分制）"]
["序号","市（州）","招聘单位","姓名","准考证号","综合成绩（百分制）","百分制综合成绩排名","是否入围体检","备注"]
[1,"毕节市","贵州黔西农村商业银行","蔡辉明","1812010321539",{"v":75.60000000000001,"d":"75.60"},1,"是"]
[2,"毕节市","贵州黔西农村商业银行","王孟会","1812010012239",{"v":73.79999999999998,"d":"73.80"},2,"是"]
[3,"毕节市","贵州黔西农村商业银行","李志萍","1812010095351",{"v":73,"d":"73.00"},3,"是"]
[4,"毕节市","贵州黔西农村商业银行","赵健丽","1812010193235",{"v":73,"d":"73.00"},3,"是"]
{"$rows_left_out":13}
{"sheet":"纳雍联社","index":34,"n_rows":48,"n_cols":9,"rows_kept":48,"merged":[[0,0,0,8]]}
["贵州省农村信用社2018年定向招聘贫困大学生进入面试人员综合成绩表（百分制）"]
["序号","市（州）","招聘单位","姓名","准考证号","综合成绩（百分制）","百分制综合成绩排名","是否入围体检","备注"]
[1,"毕节市","纳雍县农村信用合作联社","陈淑荣","1812010043505",{"v":78.10000000000001,"d":"78.10"},1,"是"]
[2,"毕节市","纳雍县农村信用合作联社","丁易","1812010275050",{"v":77.6,"d":"77.60"},2,"是"]
[3,"毕节市","纳雍县农村信用合作联社","杨辉","1812010323652",{"v":76.89999999999999,"d":"76.90"},3,"是"]
[4,"毕节市","纳雍县农村信用合作联社","张倩","1812010077738",{"v":76.5,"d":"76.50"},4,"是"]
{"$rows_left_out":43}
{"sheet":"威宁联社","index":35,"n_rows":32,"n_cols":9,"rows_kept":32,"merged":[[0,0,0,8]]}
["贵州省农村信用社2018年定向招聘贫困大学生进入面试人员综合成绩表（百分制）"]
["序号","市（州）","招聘单位","姓名","准考证号","综合成绩（百分制）","百分制综合成绩排名","是否入围体检","备注"]
[1,"毕节市","威宁县农村信用合作联社","刘界","1812010033717",{"v":74.3,"d":"74.30"},1,"是"]
[2,"毕节市","威宁县农村信用合作联社","黄勇","1812010206219",{"v":74.3,"d":"74.30"},1,"是"]
[3,"毕节市","威宁县农村信用合作联社","孟龙艳","1812010183935",{"v":74.1,"d":"74.10"},3,"是"]
[4,"毕节市","威宁县农村信用合作联社","卢主","1812010247203",{"v":72.9,"d":"72.90"},4,"是"]
{"$rows_left_out":27}
{"sheet":"赫章农商行","index":36,"n_rows":51,"n_cols":9,"rows_kept":51,"merged":[[0,0,0,8]]}
["贵州省农村信用社2018年定向招聘贫困大学生进入面试人员综合成绩表（百分制）"]
["序号","市（州）","招聘单位","姓名","准考证号","综合成绩（百分制）","百分制综合成绩排名","是否入围体检","备注"]
[1,"毕节市","贵州赫章农村商业银行","万超","1812010084527",{"v":74.7,"d":"74.70"},1,"是"]
[2,"毕节市","贵州赫章农村商业银行","李东梅","1812010063825",{"v":74.2,"d":"74.20"},2,"是"]
[3,"毕节市","贵州赫章农村商业银行","陈芳","1812010178654",{"v":73.9,"d":"73.90"},3,"是"]
[4,"毕节市","贵州赫章农村商业银行","陈景","1812010167729",{"v":73.89999999999999,"d":"73.90"},3,"是"]
{"$rows_left_out":46}
{"sheet":"金沙联社","index":37,"n_rows":20,"n_cols":9,"rows_kept":20,"merged":[[0,0,0,8]]}
["贵州省农村信用社2018年定向招聘贫困大学生进入面试人员综合成绩表（百分制）"]
["序号","市（州）","招聘单位","姓名","准考证号","综合成绩（百分制）","百分制综合成绩排名","是否入围体检","备注"]
[1,"毕节市","金沙县农村信用合作联社","夏雪梅","1812010079211",{"v":78.4,"d":"78.40"},1,"是"]
[2,"毕节市","金沙县农村信用合作联社","叶丽","1812010234622",{"v":74.39999999999999,"d":"74.40"},2,"是"]
[3,"毕节市","金沙县农村信用合作联社","刘光毅","1812010009628",{"v":71.4,"d":"71.40"},3,"是"]
[4,"毕节市","金沙县农村信用合作联社","余国江","1812010288820",{"v":71.4,"d":"71.40"},3,"是"]
{"$rows_left_out":15}
{"sheet":"织金农商行","index":38,"n_rows":14,"n_cols":9,"rows_kept":14,"merged":[[0,0,0,8]]}
["贵州省农村信用社2018年定向招聘贫困大学生进入面试人员综合成绩表（百分制）"]
["序号","市（州）","招聘单位","姓名","准考证号","综合成绩（百分制）","百分制综合成绩排名","是否入围体检","备注"]
[1,"毕节市","贵州织金农村商业银行","王玉玲","1812010106034",{"v":73.80000000000001,"d":"73.80"},1,"是"]
[2,"毕节市","贵州织金农村商业银行","丁翔翔","1812010033231",{"v":72.10000000000001,"d":"72.10"},2,"是"]
[3,"毕节市","贵州织金农村商业银行","高婷","1812010138914",{"v":71.9,"d":"71.90"},3,"是"]
[4,"毕节市","贵州织金农村商业银行","张菊","1812010244530",{"v":71.89999999999999,"d":"71.90"},3,"是"]
{"$rows_left_out":9}
{"sheet":"水城联社","index":39,"n_rows":17,"n_cols":9,"rows_kept":17,"merged":[[0,0,0,8]]}
["贵州省农村信用社2018年定向招聘贫困大学生进入面试人员综合成绩表（百分制）"]
["序号","市（州）","招聘单位","姓名","准考证号","综合成绩（百分制）","百分制综合成绩排名","是否入围体检","备注"]
[1,"六盘水市","水城县农村信用合作联社","杨明敏","1812010134341",{"v":79.2,"d":"79.20"},1,"是"]
[2,"六盘水市","水城县农村信用合作联社","龙永周","1812010063055",{"v":75.1,"d":"75.10"},2,"是"]
[3,"六盘水市","水城县农村信用合作联社","张华考","1812010214006",{"v":74.9,"d":"74.90"},3,"是"]
[4,"六盘水市","水城县农村信用合作联社","李多余","1812010109538",{"v":70.60000000000001,"d":"70.60"},4,"是"]
{"$rows_left_out":12}
{"sheet":"盘县联社","index":40,"n_rows":15,"n_cols":9,"rows_kept":15,"merged":[[0,0,0,8]]}
["贵州省农村信用社2018年定向招聘贫困大学生进入面试人员综合成绩表（百分制）"]
["序号","市（州）","招聘单位","姓名","准考证号","综合成绩（百分制）","百分制综合成绩排名","是否入围体检","备注"]
[1,"六盘水市","盘县农村信用合作联社","胡娟","1812010123133",{"v":73.70000000000002,"d":"73.70"},1,"是"]
[2,"六盘水市","盘县农村信用合作联社","谢功留","1812010304113",{"v":73.5,"d":"73.50"},2,"是"]
[3,"六盘水市","盘县农村信用合作联社","付涛","1812010118903",{"v":71.7,"d":"71.70"},3,"是"]
[4,"六盘水市","盘县农村信用合作联社","王金鹏","1812010251223",{"v":68.4,"d":"68.40"},4,"是"]
{"$rows_left_out":10}
{"sheet":"六枝联社","index":41,"n_rows":17,"n_cols":9,"rows_kept":17,"merged":[[0,0,0,8]]}
["贵州省农村信用社2018年定向招聘贫困大学生进入面试人员综合成绩表（百分制）"]
["序号","市（州）","招聘单位","姓名","准考证号","综合成绩（百分制）","百分制综合成绩排名","是否入围体检","备注"]
[1,"六盘水市","六枝特区农村信用合作联社","宋津印","1812010220174",{"v":68.8,"d":"68.80"},1,"是"]
[2,"六盘水市","六枝特区农村信用合作联社","万源","1812010295908",{"v":68.2,"d":"68.20"},2,"是"]
[3,"六盘水市","六枝特区农村信用合作联社","周宁","1812010196029",{"v":66.8,"d":"66.80"},3,"是"]
[4,"六盘水市","六枝特区农村信用合作联社","程保珍","1812010055088",{"v":64.1,"d":"64.10"},4,"是"]
{"$rows_left_out":12}
{"sheet":"六盘水农商行","index":42,"n_rows":14,"n_cols":9,"rows_kept":14,"merged":[[0,0,0,8]]}
["贵州省农村信用社2018年定向招聘贫困大学生进入面试人员综合成绩表（百分制）"]
["序号","市（州）","招聘单位","姓名","准考证号","综合成绩（百分制）","百分制综合成绩排名","是否入围体检","备注"]
[1,"六盘水市","贵州六盘水农村商业银行","刘丽",1812010102090,{"v":72.4,"d":"72.40"},1,"是"]
[2,"六盘水市","贵州六盘水农村商业银行","陈兴祥",1812010231330,{"v":71.20000000000002,"d":"71.20"},2,"是"]
[3,"六盘水市","贵州六盘水农村商业银行","罗超龙",1812010031671,{"v":71.20000000000002,"d":"71.20"},2,"是"]
[4,"六盘水市","贵州六盘水农村商业银行","彭勇",1812010276215,{"v":70.8,"d":"70.80"},4,"是"]
{"$rows_left_out":9}
{"sheet":"望谟联社","index":43,"n_rows":44,"n_cols":9,"rows_kept":44,"merged":[[0,0,0,8]]}
["贵州省农村信用社2018年定向招聘贫困大学生进入面试人员综合成绩表（百分制）"]
["序号","市（州）","招聘单位","姓名","准考证号","综合成绩（百分制）","百分制综合成绩排名","是否入围体检","备注"]
[1,"黔西南州","望谟县农村信用合作联社","杨明杰","1812010034132",{"v":71.6,"d":"71.60"},1,"是"]
[2,"黔西南州","望谟县农村信用合作联社","杨再权","1812010070121",{"v":68.5,"d":"68.50"},2,"是"]
[3,"黔西南州","望谟县农村信用合作联社","陈兰","1812010302819",{"v":68.5,"d":"68.50"},2,"是"]
[4,"黔西南州","望谟县农村信用合作联社","芒演脱","1812010011806",{"v":68.3,"d":"68.30"},4,"是"]
{"$rows_left_out":39}
{"sheet":"册亨联社","index":44,"n_rows":39,"n_cols":9,"rows_kept":39,"merged":[[0,0,0,8]]}
["贵州省农村信用社2018年定向招聘贫困大学生进入面试人员综合成绩表（百分制）"]
["序号","市（州）","招聘单位","姓名","准考证号","综合成绩（百分制）","百分制综合成绩排名","是否入围体检","备注"]
[1,"黔西南州","册亨县农村信用合作联社","罗世正","1812010070521",{"v":73,"d":"73.00"},1,"是"]
[2,"黔西南州","册亨县农村信用合作联社","罗廷显","1812010075602",{"v":72.8,"d":"72.80"},2,"是"]
[3,"黔西南州","册亨县农村信用合作联社","杨秀辉","1812010003723",{"v":70.7,"d":"70.70"},3,"是"]
[4,"黔西南州","册亨县农村信用合作联社","杨通霞","1812010193448",{"v":69.3,"d":"69.30"},4,"是"]
{"$rows_left_out":34}
{"sheet":"晴隆农商行","index":45,"n_rows":21,"n_cols":9,"rows_kept":21,"merged":[[0,0,0,8]]}
["贵州省农村信用社2018年定向招聘贫困大学生进入面试人员综合成绩表（百分制）"]
["序号","市（州）","招聘单位","姓名","准考证号","综合成绩（百分制）","百分制综合成绩排名","是否入围体检","备注"]
[1,"黔西南州","贵州晴隆农村商业银行","李沛高","1812010307624",{"v":72.8,"d":"72.80"},1,"是"]
[2,"黔西南州","贵州晴隆农村商业银行","周良成","1812010233913",{"v":71.20000000000002,"d":"71.20"},2,"是"]
[3,"黔西南州","贵州晴隆农村商业银行","罗鑫","1812010077123",{"v":70.8,"d":"70.80"},3,"是"]
[4,"黔西南州","贵州晴隆农村商业银行","吴元元","1812010260523",{"v":70.7,"d":"70.70"},4,"是"]
{"$rows_left_out":16}
{"sheet":"贞丰农商行","index":46,"n_rows":18,"n_cols":9,"rows_kept":18,"merged":[[0,0,0,8]]}
["贵州省农村信用社2018年定向招聘贫困大学生进入面试人员综合成绩表（百分制）"]
["序号","市（州）","招聘单位","姓名","准考证号","综合成绩（百分制）","百分制综合成绩排名","是否入围体检","备注"]
[1,"黔西南州","贵州贞丰农村商业银行","易秋合","1812010216608",{"v":77.6,"d":"77.60"},1,"是"]
[2,"黔西南州","贵州贞丰农村商业银行","向臣都","1812010017823",{"v":71.7,"d":"71.70"},2,"是"]
[3,"黔西南州","贵州贞丰农村商业银行","王锡高","1812010275425",{"v":69.7,"d":"69.70"},3,"是"]
[4,"黔西南州","贵州贞丰农村商业银行","韦大艳","1812010251025",{"v":69.2,"d":"69.20"},4,"是"]
{"$rows_left_out":13}
{"sheet":"安龙农商行","index":47,"n_rows":11,"n_cols":9,"rows_kept":11,"merged":[[0,0,0,8]]}
["贵州省农村信用社2018年定向招聘贫困大学生进入面试人员综合成绩表（百分制）"]
["序号","市（州）","招聘单位","姓名","准考证号","综合成绩（百分制）","百分制综合成绩排名","是否入围体检","备注"]
[1,"黔西南州","贵州安龙农村商业银行","王朝墨","1812010057940",{"v":67,"d":"67.00"},1,"是"]
[2,"黔西南州","贵州安龙农村商业银行","王德先","1812010206638",{"v":66.8,"d":"66.80"},2,"是"]
[3,"黔西南州","贵州安龙农村商业银行","邓金琼","1812010039603",{"v":66.6,"d":"66.60"},3,"是"]
[4,"黔西南州","贵州安龙农村商业银行","田井涛","1812010005214",{"v":65.7,"d":"65.70"},4,"否"]
{"$rows_left_out":6}
{"sheet":"兴义农商行","index":48,"n_rows":22,"n_cols":9,"rows_kept":22,"merged":[[0,0,0,8]]}
["贵州省农村信用社2018年定向招聘贫困大学生进入面试人员综合成绩表（百分制）"]
["序号","市（州）","招聘单位","姓名","准考证号","综合成绩（百分制）","百分制综合成绩排名","是否入围体检","备注"]
[1,"黔西南州","贵州兴义农村商业银行","刘洪雯","1812010269714",{"v":78.17999999999999,"d":"78.18"},1,"是"]
[2,"黔西南州","贵州兴义农村商业银行","龚涛","1812010124408",{"v":72.30000000000001,"d":"72.30"},2,"是"]
[3,"黔西南州","贵州兴义农村商业银行","李毕闯","1812010018732",{"v":70.96000000000001,"d":"70.96"},3,"是"]
[4,"黔西南州","贵州兴义农村商业银行","邱朝尚","1812010072326",70.07,4,"是"]
{"$rows_left_out":16}